{"text_format":"1","workbook":"xlsx","n_sheets":6,"sheets":["Instructions","Etat des revenus et dépenses","Reporting budgétaire détaillé","Registre des actifs","Catégories de subventions Gavi","Listes"],"not_rendered":{"charts":0,"images":2,"macros":1,"external_links":0,"defined_names":3,"comments":0,"pivot_tables":0},"unopened":[],"bounds":{"document_bytes":16777216,"sheet_cells":100000,"rows_first":2000,"rows_last":500,"rows_between":2000,"halvings":0,"cell_chars":16384,"cell_head_chars":4096},"cells_cut":0,"cells_raw":0,"read":"whole","date_system":"1900"}

{"sheet":"Instructions","index":0,"n_rows":24,"n_cols":5,"rows_kept":24,"cut":false,"hidden":false,"merged":[[20,1,20,2],[22,1,22,2],[23,1,23,2],[1,3,1,4],[2,3,2,4],[6,3,6,4],[7,3,7,4],[19,1,19,2],[23,3,23,4],[17,3,17,4],[9,3,9,4],[20,3,20,4],[19,3,19,4],[22,3,22,4],[21,3,21,4],[10,3,10,4]]}
[]
[]
[]
[]
[]
[]
[]
[]
[null,null,null,"Instructions générales"]
[null,null,null,"Le présent modèle est un exemple représentant les niveaux de détail attendus dans les rapports financiers soumis à Gavi.  Il devrait être utilisé en conjonction avec les Exigences de Gavi en matière de gestion financière et d'audit, que vous trouverez ici.  En 2016, l'utilisation de ce modèle est encore facultative.  \n"]
[null,null,null,"Gavi va continuer à améliorer les procédures de reporting des pays.  Ainsi, pendant que Gavi déploie des efforts concertés pour éviter d'apporter des modifications qui interrompent le déroulement du travail, les modifications au présent modèle seront progressivement introduites en s'appuyant sur les améliorations des procédures et les modifications de politique. \n\nEn cas de mécanismes financiers communs, veuillez consulter les Exigences de Gavi en matière de gestion financière et d'audit mentionnées ci-dessus. Les exigences de Gavi sont prises en compte lors de la conception de chaque mécanisme financier commun, qui est unique par nature. Il est donc recommandé que le pays discute avec le Secrétariat de Gavi les exigences de reporting financier, y compris  l'applicabilité et l'utilisation du présent modèle.\n\nPour que cet outil fonctionne correctement, veuillez activer les macros.  Le modèle ne contient pas de cellules protégées ni de formules et les utilisateurs sont invités à le modifier, à condition de respecter les formats de reporting de base.\n\nPour commencer, veuillez introduire les noms du pays et de la subvention, l'exercice financier, la devise locale, la fréquence de reporting et la période de reporting CI-DESSOUS:"]
[null,null,null,"Noms du pays et de la subvention","paysexemple - RSS 2"]
[null,null,null,"Année de de la subventioni","Jan- déc 2015"]
[null,null,null,"Exercice fiscal national","Juillet 2014 - juin 2015"]
[null,null,null,"Devise locale","EXA"]
[null,null,null,"Fréquence de reporting","Prière de choisir..."]
[null,null,null,"Période de reporting considérée","Jan- déc 2015"]
[]
[null,"Aller à la Section...:",null,"Le modèle a la structure suivante:"]
[null,"Relevé des revenus et dépenses",null,"Cet onglet est essentiellement automatisé à partir de l'onglet \"Reporting budgétaire détaillé\". Il résume les revenus et dépenses par catégorie et année. Tous les montants sont présentés en USD. Les sections à compléter manuellement sont:\n    1. Les revenus sont enregistrés pour chaque année de la subvention en USD entre les activités suivantes:\n        a) Décaissements budgétisés reçus de Gavi\n        b) Revenu des intérêts budgétisé\n        c) Autres revenus budgétisés\n        d) Décaissements réellement reçus de Gavi \n        e) Revenu des intérêts réel\n        f) Autres revenus réels\n\n    2. Commentaires sur les écarts \n\nNOTE IMPORTANTE:\nCatégories de coûts:  Gavi préfère que les pays utilisent ses catégories de dépenses.  Même s'ils ne sont pas en mesure d'extraire ces données directement de leurs systèmes comptables, les pays devraient essayer d'estimer ou de fournir un relevé de leurs propres classifications.  Si cela s'avère difficile, ils peuvent utiliser leurs propres catégories de coûts, à condition que celles-ci soient alignées en termes généraux avec les catégories de Gavi."]
{"$rows_left_out":5}
{"sheet":"Etat des revenus et dépenses","index":1,"n_rows":50,"n_cols":22,"rows_kept":50,"cut":false,"hidden":false,"merged":[[43,0,43,21],[40,0,40,21],[41,0,41,21],[42,0,42,21],[0,0,0,22],[2,1,2,4],[2,21,3,21],[2,5,2,8],[2,9,2,12],[2,13,2,16],[2,17,2,20]]}
[{"$f":"CONCATENATE(\"Income and Expenditure Statement - \",Instructions!E12)","v":"Income and Expenditure Statement - paysexemple - RSS 2"}]
[]
[null,{"$f":"'Reporting budgétaire détaillé'!I10","v":""},null,null,null,{"$f":"'Reporting budgétaire détaillé'!L10","v":""},null,null,null,{"$f":"'Reporting budgétaire détaillé'!O10","v":""},null,null,null,{"$f":"'Reporting budgétaire détaillé'!R10","v":""},null,null,null,{"$f":"Instructions!E17","v":"Jan- déc 2015"},null,null,null,"Commentaires sur les écarts"]
[null,"Annual Budget","Actual","Variance US$","Variance %","Budget annuel","Réalisés","Ecart en USD","Ecart %","Annual Budget","Actual","Variance US$","Variance %","Budget annuel","Réalisés","Ecart en USD","Ecart %","Budget annuel","Réalisés","Ecart en USD","Ecart %"]
["Revenus"]
["Reçu de Gavi",null,null,{"$f":"C6-B6","v":0},{"$f":"IFERROR(D6/B6,0)","v":0},null,null,{"$f":"G6-F6","v":0},{"$f":"IFERROR(H6/F6,0)","v":0},null,null,{"$f":"K6-J6","v":0},{"$f":"IFERROR(L6/J6,0)","v":0},null,null,{"$f":"O6-N6","v":0},{"$f":"IFERROR(P6/N6,0)","v":0},null,null,{"$f":"S6-R6","v":0},{"$f":"IFERROR(T6/R6,0)","v":0}]
["Revenus provenant des intérêts",null,null,{"$f":"C7-B7","v":0},{"$f":"IFERROR(D7/B7,1)","v":1},null,null,{"$f":"G7-F7","v":0},{"$f":"IFERROR(H7/F7,1)","v":1},null,null,{"$f":"K7-J7","v":0},{"$f":"IFERROR(L7/J7,1)","v":1},null,null,{"$f":"O7-N7","v":0},{"$f":"IFERROR(P7/N7,1)","v":1},null,null,{"$f":"S7-R7","v":0},{"$f":"IFERROR(T7/R7,1)","v":1}]
["Autres revenus",null,null,0,{"$f":"IFERROR(D8/B8,0)","v":0},null,null,0,{"$f":"IFERROR(H8/F8,0)","v":0},null,null,0,{"$f":"IFERROR(L8/J8,0)","v":0},null,null,0,{"$f":"IFERROR(P8/N8,0)","v":0},null,null,0,{"$f":"IFERROR(T8/R8,0)","v":0}]
["Revenus totaux",{"$f":"SUM(B6:B8)","v":0},{"$f":"SUM(C6:C8)","v":0},0,0,{"$f":"SUM(F6:F8)","v":0},{"$f":"SUM(G6:G8)","v":0},0,0,{"$f":"SUM(J6:J8)","v":0},{"$f":"SUM(K6:K8)","v":0},0,0,{"$f":"SUM(N6:N8)","v":0},{"$f":"SUM(O6:O8)","v":0},0,0,{"$f":"SUM(R6:R8)","v":0},{"$f":"SUM(S6:S8)","v":0},0,0]
[]
["Dépenses"]
["1 Prestation de services",{"$f":"SUMIFS('Reporting budgétaire détaillé'!H:H,'Reporting budgétaire détaillé'!B:B,A12)","v":0},{"$f":"SUMIFS('Reporting budgétaire détaillé'!K:K,'Reporting budgétaire détaillé'!B:B,A12)","v":0},{"$f":"B12-C12","v":0},{"$f":"IFERROR(D12/B12,0)","v":0},{"$f":"SUMIFS('Reporting budgétaire détaillé'!H:H,'Reporting budgétaire détaillé'!B:B,A12)","v":0},{"$f":"SUMIFS('Reporting budgétaire détaillé'!N:N,'Reporting budgétaire détaillé'!B:B,A12)","v":0},{"$f":"F12-G12","v":0},{"$f":"IFERROR(H12/F12,0)","v":0},{"$f":"SUMIFS('Reporting budgétaire détaillé'!H:H,'Reporting budgétaire détaillé'!B:B,A12)","v":0},{"$f":"SUMIFS('Reporting budgétaire détaillé'!Q:Q,'Reporting budgétaire détaillé'!B:B,A12)","v":0},{"$f":"J12-K12","v":0},{"$f":"IFERROR(L12/J12,0)","v":0},{"$f":"SUMIFS('Reporting budgétaire détaillé'!H:H,'Reporting budgétaire détaillé'!B:B,A12)","v":0},{"$f":"SUMIFS('Reporting budgétaire détaillé'!T:T,'Reporting budgétaire détaillé'!B:B,A12)","v":0},null,{"$f":"IFERROR(P12/N12,0)","v":0},{"$f":"SUMIFS('Reporting budgétaire détaillé'!H:H,'Reporting budgétaire détaillé'!B:B,A12)","v":0},{"$f":"C12+G12+K12+O12","v":0},{"$f":"R12-S12","v":0},{"$f":"IFERROR(T12/R12,0)","v":0}]
["2 Personnel et ressources humaines",{"$f":"SUMIFS('Reporting budgétaire détaillé'!H:H,'Reporting budgétaire détaillé'!B:B,A13)","v":0},{"$f":"SUMIFS('Reporting budgétaire détaillé'!K:K,'Reporting budgétaire détaillé'!B:B,A13)","v":0},0,0,{"$f":"SUMIFS('Reporting budgétaire détaillé'!H:H,'Reporting budgétaire détaillé'!B:B,A13)","v":0},{"$f":"SUMIFS('Reporting budgétaire détaillé'!N:N,'Reporting budgétaire détaillé'!B:B,A13)","v":0},0,0,{"$f":"SUMIFS('Reporting budgétaire détaillé'!H:H,'Reporting budgétaire détaillé'!B:B,A13)","v":0},{"$f":"SUMIFS('Reporting budgétaire détaillé'!Q:Q,'Reporting budgétaire détaillé'!B:B,A13)","v":0},0,0,{"$f":"SUMIFS('Reporting budgétaire détaillé'!H:H,'Reporting budgétaire détaillé'!B:B,A13)","v":0},{"$f":"SUMIFS('Reporting budgétaire détaillé'!T:T,'Reporting budgétaire détaillé'!B:B,A13)","v":0},null,0,{"$f":"SUMIFS('Reporting budgétaire détaillé'!H:H,'Reporting budgétaire détaillé'!B:B,A13)","v":0},{"$f":"C13+G13+K13+O13","v":0},0,0]
["3 Achats et gestion de la chaîne d'approvisionnement ",{"$f":"SUMIFS('Reporting budgétaire détaillé'!H:H,'Reporting budgétaire détaillé'!B:B,A14)","v":0},{"$f":"SUMIFS('Reporting budgétaire détaillé'!K:K,'Reporting budgétaire détaillé'!B:B,A14)","v":0},0,0,{"$f":"SUMIFS('Reporting budgétaire détaillé'!H:H,'Reporting budgétaire détaillé'!B:B,A14)","v":0},{"$f":"SUMIFS('Reporting budgétaire détaillé'!N:N,'Reporting budgétaire détaillé'!B:B,A14)","v":0},0,0,{"$f":"SUMIFS('Reporting budgétaire détaillé'!H:H,'Reporting budgétaire détaillé'!B:B,A14)","v":0},{"$f":"SUMIFS('Reporting budgétaire détaillé'!Q:Q,'Reporting budgétaire détaillé'!B:B,A14)","v":0},0,0,{"$f":"SUMIFS('Reporting budgétaire détaillé'!H:H,'Reporting budgétaire détaillé'!B:B,A14)","v":0},{"$f":"SUMIFS('Reporting budgétaire détaillé'!T:T,'Reporting budgétaire détaillé'!B:B,A14)","v":0},null,0,{"$f":"SUMIFS('Reporting budgétaire détaillé'!H:H,'Reporting budgétaire détaillé'!B:B,A14)","v":0},0,0,0]
["4 Systèmes d'information sanitaire",{"$f":"SUMIFS('Reporting budgétaire détaillé'!H:H,'Reporting budgétaire détaillé'!B:B,A15)","v":0},{"$f":"SUMIFS('Reporting budgétaire détaillé'!K:K,'Reporting budgétaire détaillé'!B:B,A15)","v":0},0,0,{"$f":"SUMIFS('Reporting budgétaire détaillé'!H:H,'Reporting budgétaire détaillé'!B:B,A15)","v":0},{"$f":"SUMIFS('Reporting budgétaire détaillé'!N:N,'Reporting budgétaire détaillé'!B:B,A15)","v":0},0,0,{"$f":"SUMIFS('Reporting budgétaire détaillé'!H:H,'Reporting budgétaire détaillé'!B:B,A15)","v":0},{"$f":"SUMIFS('Reporting budgétaire détaillé'!Q:Q,'Reporting budgétaire détaillé'!B:B,A15)","v":0},0,0,{"$f":"SUMIFS('Reporting budgétaire détaillé'!H:H,'Reporting budgétaire détaillé'!B:B,A15)","v":0},{"$f":"SUMIFS('Reporting budgétaire détaillé'!T:T,'Reporting budgétaire détaillé'!B:B,A15)","v":0},null,0,{"$f":"SUMIFS('Reporting budgétaire détaillé'!H:H,'Reporting budgétaire détaillé'!B:B,A15)","v":0},0,0,0]
["5 Acteurs communautaires et autres acteurs locaux",{"$f":"SUMIFS('Reporting budgétaire détaillé'!H:H,'Reporting budgétaire détaillé'!B:B,A16)","v":0},{"$f":"SUMIFS('Reporting budgétaire détaillé'!K:K,'Reporting budgétaire détaillé'!B:B,A16)","v":0},0,0,{"$f":"SUMIFS('Reporting budgétaire détaillé'!H:H,'Reporting budgétaire détaillé'!B:B,A16)","v":0},{"$f":"SUMIFS('Reporting budgétaire détaillé'!N:N,'Reporting budgétaire détaillé'!B:B,A16)","v":0},0,0,{"$f":"SUMIFS('Reporting budgétaire détaillé'!H:H,'Reporting budgétaire détaillé'!B:B,A16)","v":0},{"$f":"SUMIFS('Reporting budgétaire détaillé'!Q:Q,'Reporting budgétaire détaillé'!B:B,A16)","v":0},0,0,{"$f":"SUMIFS('Reporting budgétaire détaillé'!H:H,'Reporting budgétaire détaillé'!B:B,A16)","v":0},{"$f":"SUMIFS('Reporting budgétaire détaillé'!T:T,'Reporting budgétaire détaillé'!B:B,A16)","v":0},null,0,{"$f":"SUMIFS('Reporting budgétaire détaillé'!H:H,'Reporting budgétaire détaillé'!B:B,A16)","v":0},0,0,0]
["6 Environnements juridiques, politiques et régulateurs",{"$f":"SUMIFS('Reporting budgétaire détaillé'!H:H,'Reporting budgétaire détaillé'!B:B,A17)","v":0},{"$f":"SUMIFS('Reporting budgétaire détaillé'!K:K,'Reporting budgétaire détaillé'!B:B,A17)","v":0},0,0,{"$f":"SUMIFS('Reporting budgétaire détaillé'!H:H,'Reporting budgétaire détaillé'!B:B,A17)","v":0},{"$f":"SUMIFS('Reporting budgétaire détaillé'!N:N,'Reporting budgétaire détaillé'!B:B,A17)","v":0},0,0,{"$f":"SUMIFS('Reporting budgétaire détaillé'!H:H,'Reporting budgétaire détaillé'!B:B,A17)","v":0},{"$f":"SUMIFS('Reporting budgétaire détaillé'!Q:Q,'Reporting budgétaire détaillé'!B:B,A17)","v":0},0,0,{"$f":"SUMIFS('Reporting budgétaire détaillé'!H:H,'Reporting budgétaire détaillé'!B:B,A17)","v":0},{"$f":"SUMIFS('Reporting budgétaire détaillé'!T:T,'Reporting budgétaire détaillé'!B:B,A17)","v":0},null,0,{"$f":"SUMIFS('Reporting budgétaire détaillé'!H:H,'Reporting budgétaire détaillé'!B:B,A17)","v":0},0,0,0]
["7 Financement de la santé",{"$f":"SUMIFS('Reporting budgétaire détaillé'!H:H,'Reporting budgétaire détaillé'!B:B,A18)","v":0},{"$f":"SUMIFS('Reporting budgétaire détaillé'!K:K,'Reporting budgétaire détaillé'!B:B,A18)","v":0},0,0,{"$f":"SUMIFS('Reporting budgétaire détaillé'!H:H,'Reporting budgétaire détaillé'!B:B,A18)","v":0},{"$f":"SUMIFS('Reporting budgétaire détaillé'!N:N,'Reporting budgétaire détaillé'!B:B,A18)","v":0},0,0,{"$f":"SUMIFS('Reporting budgétaire détaillé'!H:H,'Reporting budgétaire détaillé'!B:B,A18)","v":0},{"$f":"SUMIFS('Reporting budgétaire détaillé'!Q:Q,'Reporting budgétaire détaillé'!B:B,A18)","v":0},0,0,{"$f":"SUMIFS('Reporting budgétaire détaillé'!H:H,'Reporting budgétaire détaillé'!B:B,A18)","v":0},{"$f":"SUMIFS('Reporting budgétaire détaillé'!T:T,'Reporting budgétaire détaillé'!B:B,A18)","v":0},null,0,{"$f":"SUMIFS('Reporting budgétaire détaillé'!H:H,'Reporting budgétaire détaillé'!B:B,A18)","v":0},0,0,0]
["8 Gestion du programme",{"$f":"SUMIFS('Reporting budgétaire détaillé'!H:H,'Reporting budgétaire détaillé'!B:B,A19)","v":0},{"$f":"SUMIFS('Reporting budgétaire détaillé'!K:K,'Reporting budgétaire détaillé'!B:B,A19)","v":0},0,0,{"$f":"SUMIFS('Reporting budgétaire détaillé'!H:H,'Reporting budgétaire détaillé'!B:B,A19)","v":0},{"$f":"SUMIFS('Reporting budgétaire détaillé'!N:N,'Reporting budgétaire détaillé'!B:B,A19)","v":0},0,0,{"$f":"SUMIFS('Reporting budgétaire détaillé'!H:H,'Reporting budgétaire détaillé'!B:B,A19)","v":0},{"$f":"SUMIFS('Reporting budgétaire détaillé'!Q:Q,'Reporting budgétaire détaillé'!B:B,A19)","v":0},0,0,{"$f":"SUMIFS('Reporting budgétaire détaillé'!H:H,'Reporting budgétaire détaillé'!B:B,A19)","v":0},{"$f":"SUMIFS('Reporting budgétaire détaillé'!T:T,'Reporting budgétaire détaillé'!B:B,A19)","v":0},null,0,{"$f":"SUMIFS('Reporting budgétaire détaillé'!H:H,'Reporting budgétaire détaillé'!B:B,A19)","v":0},0,0,0]
["9 Autres",{"$f":"SUMIFS('Reporting budgétaire détaillé'!H:H,'Reporting budgétaire détaillé'!B:B,A20)","v":0},{"$f":"SUMIFS('Reporting budgétaire détaillé'!K:K,'Reporting budgétaire détaillé'!B:B,A20)","v":0},{"$f":"B20-C20","v":0},{"$f":"IFERROR(D20/B20,0)","v":0},{"$f":"SUMIFS('Reporting budgétaire détaillé'!H:H,'Reporting budgétaire détaillé'!B:B,A20)","v":0},{"$f":"SUMIFS('Reporting budgétaire détaillé'!N:N,'Reporting budgétaire détaillé'!B:B,A20)","v":0},0,0,{"$f":"SUMIFS('Reporting budgétaire détaillé'!H:H,'Reporting budgétaire détaillé'!B:B,A20)","v":0},{"$f":"SUMIFS('Reporting budgétaire détaillé'!Q:Q,'Reporting budgétaire détaillé'!B:B,A20)","v":0},0,0,{"$f":"SUMIFS('Reporting budgétaire détaillé'!H:H,'Reporting budgétaire détaillé'!B:B,A20)","v":0},{"$f":"SUMIFS('Reporting budgétaire détaillé'!T:T,'Reporting budgétaire détaillé'!B:B,A20)","v":0},null,0,{"$f":"SUMIFS('Reporting budgétaire détaillé'!H:H,'Reporting budgétaire détaillé'!B:B,A20)","v":0},0,0,0]
{"$rows_left_out":31}
{"sheet":"Reporting budgétaire détaillé","index":2,"n_rows":89,"n_cols":23,"rows_kept":89,"cut":false,"hidden":false,"merged":[[0,0,0,22],[8,8,8,21],[9,8,9,10],[9,11,9,13],[9,14,9,16],[9,17,9,19],[9,20,9,21],[8,22,9,22],[8,0,9,7]]}
[{"$f":"CONCATENATE(\"Detailed Budget Reporting - \",Instructions!E12)","v":"Detailed Budget Reporting - paysexemple - RSS 2"}]
[]
["Local Currency",{"$f":"Instructions!E15","v":"EXA"}]
["Reporting Frequency",{"$f":"Instructions!E16","v":"Prière de choisir..."}]
["Reporting Period",{"$f":"Instructions!E17","v":"Jan- déc 2015"}]
[]
["Dépenses"]
[]
["Selon budget  approuvé de la subvention RSS",null,null,null,null,null,null,null,"Dépenses",null,null,null,null,null,null,null,null,null,null,null,null,null,{"$f":"B5","v":"Jan- déc 2015"}]
[null,null,null,null,null,null,null,null,{"$f":"IFERROR(IF($B$4=\"Trimestrielle\",\"T1\",\"\"),\"\")","v":""},null,null,{"$f":"IF($B$4=\"Trimestrielle\",\"T2\",IF($B$4=\"Semestrielle\",\"Semestre 1\",\"\"))","v":""},null,null,{"$f":"IFERROR(IF($B$4=\"Trimestrielle\",\"T3\",\"\"),\"\")","v":""},null,null,{"$f":"IF($B$4=\"Trimestrielle\",\"T4\",IF($B$4=\"Semestrielle\",\"Semestre 2\",\"\"))","v":""},null,null,"Total"]
["Objectif de la proposition du RSS (selon budget approuvé)","Catégorie","Activité","Description de l'activité","Unité d'intrant","Coût unitaire de l'intrant","Quantité","Budget \nen USD","Nbre unités",{"$f":"CONCATENATE(\"Dépenses \",$B$3)","v":"Dépenses EXA"},"Dépenses en USD","Nbre unités",{"$f":"CONCATENATE(\"Dépenses \",$B$3)","v":"Dépenses EXA"},"Dépenses en USD","Nbre unités",{"$f":"CONCATENATE(\"Dépenses \",$B$3)","v":"Dépenses EXA"},"Dépenses en USD","Nbre unités",{"$f":"CONCATENATE(\"Dépenses \",$B$3)","v":"Dépenses EXA"},"Dépenses en USD",{"$f":"CONCATENATE(\"Total \",$B$3)","v":"Total EXA"},"Total USD","Observations"]
[]
[null,"Prière de choisir...",null,null,null,10000,24,240000,null,null,null,null,null,null,null,null,null,null,null,null,{"$f":"J13+M13+P13+S13","v":0},{"$f":"K13+N13+Q13+T13","v":0}]
[null,"Prière de choisir...",null,null,null,109920,4,439680,null,null,null,null,null,null,null,null,null,null,null,null,{"$f":"J14+M14+P14+S14","v":0},0]
[null,"Prière de choisir...",null,null,null,2200,50,110000,null,null,null,null,null,null,null,null,null,null,null,null,0,0]
[null,"Prière de choisir...",null,null,null,30,1832,54960,null,null,null,null,null,null,null,null,null,null,null,null,0,0]
[null,"Prière de choisir...",null,null,null,22000,4,88000,null,null,null,null,null,null,null,null,null,null,null,null,0,0]
[null,"Prière de choisir...",null,null,null,1400,12,16800,null,null,null,null,null,null,null,null,null,null,null,null,0,0]
[null,"Prière de choisir...",null,null,null,74586,4,298344,null,null,null,null,null,null,null,null,null,null,null,null,0,0]
[null,"Prière de choisir...",null,null,null,20000,4,80000,null,null,null,null,null,null,null,null,null,null,null,null,0,0]
{"$rows_left_out":70}
{"sheet":"Registre des actifs","index":3,"n_rows":36,"n_cols":8,"rows_kept":36,"cut":false,"hidden":false,"merged":[[35,0,35,7],[0,0,0,7],[3,0,3,7],[11,0,11,7],[19,0,19,7],[27,0,27,7]]}
[{"$f":"CONCATENATE(\"Asset Register - \",Instructions!E12)","v":"Asset Register - paysexemple - RSS 2"}]
[]
["Description de l'actif","Coûts unitaires USD","Unités","Date d'achat","Emplacement","Numéro de série","Etat","Autres commentaires"]
["Véhicules"]
[]
[]
[]
[]
[]
[]
[]
["Chaîne de Froid"]
[]
[]
[]
[]
[]
[]
[]
["Ordinateurs et équipement informatique"]
{"$rows_left_out":17}
{"sheet":"Catégories de subventions Gavi","index":4,"n_rows":43,"n_cols":2,"rows_kept":43,"cut":false,"hidden":false,"merged":[]}
["Catégorie","Sous-catégorie"]
["1 Prestation de services","1,1. Investissements dans les infrastructures, y compris rénovations "]
["","1.2 Achat de véhicules"]
["","1.3 Achat d'équipement et de matériel médical pour la prestation de services"]
["","1.4 Amélioration de l'organisation et gestion de la prestation de services et qualité des soins "]
["","1.3 Frais de fonctionnement (frais récurrents) de la prestation de services de vaccination, y compris l'entretien"]
["","1.6 Amélioration du système de gestion des déchets"]
["","1.7 Autres activités de prestation de services"]
["2 Personnel et ressources humaines","2.1 Gestion des travailleurs sanitaires et communautaires"]
["","2.2 Formation avant l'emploi et renforcement des capacités (professionnels de santé) "]
["","2.3 Formation en cours d'emploi et renforcement des capacités des professionnels de santé (général)"]
["","2.4 Formation et renforcement des capacités des travailleurs de santé bénévoles et communautaires (général)"]
["","2.5 Formation et renforcement des capacité sur la chaîne d'approvisionnement"]
["","2.6 Formation et renforcement des capacité en reporting des données de routine"]
["","2.7 Formation et renforcement des capacité en analyse et recherche des données, y compris l'utilisation stratégique des données et des informations pour la gestion du programme"]
["","2.8 Autres activités du personnel sanitaire et communautaire"]
["3 Achats et gestion de la chaîne d'approvisionnement ","3.1. Amélioration du système de gestion de la chaîne d’approvisionnement"]
["","3.2 Mise à niveau ou modernisation de l'infrastructure de gestion des achats et des approvisionnements, y compris les installations de la chaîne du froid"]
["","3.3 Achat d'équipement de la chaîne du froid"]
["","3.4 Achat de véhicules pour la chaîne d'approvisionnement"]
{"$rows_left_out":24}
{"sheet":"Listes","index":5,"n_rows":12,"n_cols":3,"rows_kept":12,"cut":false,"hidden":true,"merged":[]}
["Catégories de subventions Gavi",null,"Fréquence de reporting"]
["Prière de choisir...",null,"Prière de choisir..."]
["1 Prestation de services",null,"Trimestrielle"]
["2 Personnel et ressources humaines",null,"Semestrielle"]
["3 Achats et gestion de la chaîne d'approvisionnement ",null,"Annuelle"]
["4 Systèmes d'information sanitaire"]
["5 Acteurs communautaires et autres acteurs locaux"]
["6 Environnements juridiques, politiques et régulateurs"]
["7 Financement de la santé"]
["8 Gestion du programme"]
["9 Autres"]
["10 Frais de soutien au programme"]